{"text_format":"1","workbook":"xlsx","n_sheets":51,"sheets":["COVER","COVER FOR","COVER SUM","TP","TP PA","PA","SUMPA","RAPOR","TP PKN","PKN","SUMPKN","TP BI","BI","SUMBI","TP MAT","MAT","SUMMAT","TP IPAS","IPAS","SUMIPAS","TP MUSIK","MUSIK","SUMMUSIK","TP TARI","TARI","SUMTARI","TP KRIYA","KRIYA","SUMKRIYA","TP TEATER","TEATER","SUMTEATER","TP PJOK","PJOK","SUMPJOK","REKAPNA","TP BING","BING","SUMBING","TP MULOK1","MULOK1","SUMM1","TP MULOK2","MULOK2","SUMM2","IDENTITAS","EKSTRA","SAMPUL","Data Siswa","MUTASI","INDUK"],"not_rendered":{"charts":0,"images":10,"macros":1,"external_links":1,"defined_names":28,"comments":0,"pivot_tables":0},"unopened":[],"bounds":{"document_bytes":16777216,"sheet_cells":100000,"rows_first":2000,"rows_last":500,"rows_between":2000,"halvings":0,"cell_chars":16384,"cell_head_chars":4096},"cells_cut":0,"cells_raw":0,"read":"whole","date_system":"1900"}

{"sheet":"COVER","index":0,"n_rows":21,"n_cols":7,"rows_kept":21,"cut":false,"hidden":false,"merged":[[2,1,2,14],[3,1,3,14],[6,6,6,9],[5,6,5,9],[20,5,20,10]]}
[]
[]
[null,"PENILAIAN KURIKULUM"]
[null,"SEKOLAH PENGGERAK"]
[]
[null,null,null,null,null,null,"INPUT NILAI"]
{"$rows_left_out":16}
{"sheet":"COVER FOR","index":1,"n_rows":21,"n_cols":14,"rows_kept":21,"cut":false,"hidden":false,"merged":[[2,0,2,14],[4,1,4,14]]}
[]
[]
["INPUT NILAI ASESMEN FORMATIF"]
[]
[null,"Silahkan Input Nilai Asesmen Formatif Sesuai dengan Tujuan Pembelajaran yang dituliskan"]
[]
{"$rows_left_out":16}
{"sheet":"COVER SUM","index":2,"n_rows":21,"n_cols":13,"rows_kept":21,"cut":false,"hidden":false,"merged":[[2,0,2,14],[4,1,4,14]]}
[]
[]
["INPUT NILAI ASESMEN SUMATIF"]
[]
[null,"Silahkan Input Nilai Asesmen Sumatif Sesuai dengan Lingkup Materi yang diajarkan"]
[]
{"$rows_left_out":16}
{"sheet":"TP","index":3,"n_rows":22,"n_cols":13,"rows_kept":22,"cut":false,"hidden":false,"merged":[[2,0,2,14],[4,1,4,14],[5,1,5,14]]}
[]
[]
["TUJUAN PEMBELAJARAN"]
[]
[null,"Tuliskan Tujuan Pembelajaran di masing-masing kolom Mata Pelajaran yang tersedia"]
[null,"Tujuan Pembelajaran yang dituliskan akan menjadi deskripsi di Rapor"]
{"$rows_left_out":17}
{"sheet":"TP PA","index":4,"n_rows":28,"n_cols":10,"rows_kept":28,"cut":false,"hidden":false,"merged":[[2,6,2,9],[2,0,2,5]]}
[]
[]
["ALUR TUJUAN PEMBELAJARAN ",null,null,null,null,null,"LINGKUP MATERI"]
[]
[null,"Mata Pelajaran",null,null,{"$f":"\": \"&IDENTITAS!$G$5","v":": Pendidikan Agama"},null,null,"Mata Pelajaran",null,{"$f":"\": \"&IDENTITAS!$G$5","v":": Pendidikan Agama"}]
[null,"Semester",null,null,{"$f":"\": \"&IDENTITAS!$D$21","v":": "},null,null,"Semester",null,{"$f":"\": \"&IDENTITAS!$D$21","v":": "}]
{"$rows_left_out":23}
{"sheet":"PA","index":5,"n_rows":62,"n_cols":31,"rows_kept":62,"cut":false,"hidden":false,"merged":[[2,0,2,24],[9,28,9,30],[61,1,61,2],[8,3,8,22],[7,3,7,22],[7,1,10,1],[7,2,10,2],[7,23,10,23],[9,25,9,27]]}
[]
[]
["DAFTAR NILAI ASESMEN FORMATIF"]
[]
[null,null,"Mata Pelajaran",":","Pendidikan Agama"]
[]
{"$rows_left_out":57}
{"sheet":"SUMPA","index":6,"n_rows":62,"n_cols":35,"rows_kept":62,"cut":false,"hidden":false,"merged":[[7,3,7,26],[2,0,2,27],[7,1,10,1],[7,2,10,2],[7,27,10,27],[9,3,9,4],[9,5,9,6],[9,7,9,8],[9,9,9,10],[9,11,9,12],[9,13,9,14],[9,15,9,16],[9,17,9,18],[9,19,9,20],[9,21,9,22],[9,23,9,24],[9,29,9,31],[9,32,9,34],[61,1,61,2],[8,3,8,14],[8,15,8,26],[9,25,9,26]]}
[]
[]
["DAFTAR NILAI ASESMEN SUMATIF"]
[]
[null,null,"Mata Pelajaran",":",null,"Pendidikan Agama"]
[]
{"$rows_left_out":57}
{"sheet":"RAPOR","index":7,"n_rows":69,"n_cols":18,"rows_kept":69,"cut":false,"hidden":false,"merged":[[61,4,61,6],[62,4,62,6],[67,4,67,6],[68,4,68,6],[59,7,59,10],[60,7,60,10],[53,7,53,10],[54,7,54,10],[41,3,42,3],[41,4,41,10],[42,4,42,10],[44,4,44,10],[45,4,45,10],[46,4,46,10],[47,4,47,10],[49,2,49,4],[2,1,2,10],[3,1,3,10],[24,1,25,1],[26,1,27,1],[28,1,29,1],[26,3,27,3],[26,4,26,10],[27,4,27,10],[28,3,29,3],[19,3,20,3],[19,4,19,10],[20,4,20,10],[28,4,28,10],[29,4,29,10],[21,3,22,3],[21,4,21,10],[39,3,40,3],[39,4,39,10],[40,4,40,10],[30,3,31,3],[30,4,30,10],[31,4,31,10],[33,3,34,3],[33,4,33,10],[34,4,34,10],[37,1,37,10],[38,4,38,10],[30,1,31,1],[32,4,32,10],[35,3,36,3],[35,4,35,10],[36,4,36,10],[22,4,22,10],[24,3,25,3],[24,4,24,10],[25,4,25,10],[23,2,23,10],[39,1,40,1],[39,2,40,2],[41,1,42,1],[41,2,42,2],[13,4,13,10],[14,4,14,10],[13,3,14,3],[15,3,16,3],[15,4,15,10],[16,4,16,10],[26,2,27,2],[28,2,29,2],[30,2,31,2],[33,2,34,2],[33,1,34,1],[35,1,36,1],[12,4,12,10],[13,1,14,1],[13,2,14,2],[35,2,36,2],[21,1,22,1],[21,2,22,2],[24,2,25,2],[15,1,16,1],[15,2,16,2],[17,1,18,1],[17,2,18,2],[19,1,20,1],[19,2,20,2],[17,4,17,10],[18,4,18,10],[17,3,18,3]]}
[]
[null,null,null,null,null,null,null,null,null,null,null,1]
[null,"LAPORAN HASIL BELAJAR",null,null,null,null,null,null,null,null,null,null,null,null,null,null,"●","Untuk melihat hasil sebelum di print Klik Print Preview"]
[null,"(RAPOR)",null,null,null,null,null,null,null,null,null,null,null,null,null,null,"●","Untuk mencetak rapor, klik Print Out"]
[null,null,null,null,null,null,null,null,null,null,null,null,null,null,null,null,"●","Jika tombol tidak berfungsi, cek di bagian atas biasanya "]
[null,null,null,null,null,null,null,null,null,null,null,null,null,null,null,null,null,"ada Security Warning Macros have been disabled. "]
{"$rows_left_out":64}
{"sheet":"TP PKN","index":8,"n_rows":28,"n_cols":10,"rows_kept":28,"cut":false,"hidden":false,"merged":[[2,0,2,5],[2,6,2,9]]}
[]
[]
["ALUR TUJUAN PEMBELAJARAN ",null,null,null,null,null,"LINGKUP MATERI"]
[]
[null,"Mata Pelajaran",null,null,{"$f":"\": \"&IDENTITAS!$G$6","v":": Pendidikan Pancasila dan Kewarganegaraan"},null,null,"Mata Pelajaran",null,{"$f":"\": \"&IDENTITAS!$G$6","v":": Pendidikan Pancasila dan Kewarganegaraan"}]
[null,"Semester",null,null,{"$f":"\": \"&IDENTITAS!$D$21","v":": "},null,null,"Semester",null,{"$f":"\": \"&IDENTITAS!$D$21","v":": "}]
{"$rows_left_out":23}
{"sheet":"PKN","index":9,"n_rows":62,"n_cols":31,"rows_kept":62,"cut":false,"hidden":false,"merged":[[9,25,9,27],[9,28,9,30],[61,1,61,2],[2,0,2,23],[7,1,10,1],[7,2,10,2],[7,3,7,22],[7,23,10,23],[8,3,8,22]]}
[]
[]
["DAFTAR NILAI ASESMEN FORMATIF"]
[]
[null,null,"Mata Pelajaran",":","Pendidikan Pancasila dan Kewarganegaraan"]
[]
{"$rows_left_out":57}
{"sheet":"SUMPKN","index":10,"n_rows":62,"n_cols":35,"rows_kept":62,"cut":false,"hidden":false,"merged":[[9,29,9,31],[9,32,9,34],[61,1,61,2],[9,9,9,10],[9,11,9,12],[9,13,9,14],[9,15,9,16],[9,17,9,18],[9,19,9,20],[2,0,2,27],[7,1,10,1],[7,2,10,2],[7,3,7,26],[7,27,10,27],[8,3,8,14],[8,15,8,26],[9,3,9,4],[9,5,9,6],[9,7,9,8],[9,21,9,22],[9,23,9,24],[9,25,9,26]]}
[]
[]
["DAFTAR NILAI ASESMEN SUMATIF"]
[]
[null,null,"Mata Pelajaran",":",null,"Pendidkan Pancasila dan Kewarganegaraan"]
[]
{"$rows_left_out":57}
{"sheet":"TP BI","index":11,"n_rows":28,"n_cols":10,"rows_kept":28,"cut":false,"hidden":false,"merged":[[2,0,2,5],[2,6,2,9]]}
[]
[]
["ALUR TUJUAN PEMBELAJARAN ",null,null,null,null,null,"LINGKUP MATERI"]
[]
[null,"Mata Pelajaran",null,null,{"$f":"\": \"&IDENTITAS!$G$7","v":": Bahasa Indonesia"},null,null,"Mata Pelajaran",null,{"$f":"\": \"&IDENTITAS!$G$7","v":": Bahasa Indonesia"}]
[null,"Semester",null,null,{"$f":"\": \"&IDENTITAS!$D$21","v":": "},null,null,"Semester",null,{"$f":"\": \"&IDENTITAS!$D$21","v":": "}]
{"$rows_left_out":23}
{"sheet":"BI","index":12,"n_rows":62,"n_cols":31,"rows_kept":62,"cut":false,"hidden":false,"merged":[[9,25,9,27],[9,28,9,30],[61,1,61,2],[2,0,2,23],[7,1,10,1],[7,2,10,2],[7,3,7,22],[7,23,10,23],[8,3,8,22]]}
[]
[]
["DAFTAR NILAI ASESMEN FORMATIF"]
[]
[null,null,"Mata Pelajaran",":","Bahasa Indonesia"]
[]
{"$rows_left_out":57}
{"sheet":"SUMBI","index":13,"n_rows":62,"n_cols":35,"rows_kept":62,"cut":false,"hidden":false,"merged":[[9,29,9,31],[9,32,9,34],[61,1,61,2],[9,9,9,10],[9,11,9,12],[9,13,9,14],[9,15,9,16],[9,17,9,18],[9,19,9,20],[2,0,2,27],[7,1,10,1],[7,2,10,2],[7,3,7,26],[7,27,10,27],[8,3,8,14],[8,15,8,26],[9,3,9,4],[9,5,9,6],[9,7,9,8],[9,21,9,22],[9,23,9,24],[9,25,9,26]]}
[]
[]
["DAFTAR NILAI ASESMEN SUMATIF"]
[]
[null,null,"Mata Pelajaran",":",null,"Bahasa Indonesia"]
[]
{"$rows_left_out":57}
{"sheet":"TP MAT","index":14,"n_rows":28,"n_cols":10,"rows_kept":28,"cut":false,"hidden":false,"merged":[[2,0,2,5],[2,6,2,9]]}
[]
[]
["ALUR TUJUAN PEMBELAJARAN ",null,null,null,null,null,"LINGKUP MATERI"]
[]
[null,"Mata Pelajaran",null,null,{"$f":"\": \"&IDENTITAS!$G$8","v":": Matematika"},null,null,"Mata Pelajaran",null,{"$f":"\": \"&IDENTITAS!$G$8","v":": Matematika"}]
[null,"Semester",null,null,{"$f":"\": \"&IDENTITAS!$D$21","v":": "},null,null,"Semester",null,{"$f":"\": \"&IDENTITAS!$D$21","v":": "}]
{"$rows_left_out":23}
{"sheet":"MAT","index":15,"n_rows":62,"n_cols":31,"rows_kept":62,"cut":false,"hidden":false,"merged":[[9,25,9,27],[9,28,9,30],[61,1,61,2],[2,0,2,23],[7,1,10,1],[7,2,10,2],[7,3,7,22],[7,23,10,23],[8,3,8,22]]}
[]
[]
["DAFTAR NILAI ASESMEN FORMATIF"]
[]
[null,null,"Mata Pelajaran",":","Matematika"]
[]
{"$rows_left_out":57}
{"sheet":"SUMMAT","index":16,"n_rows":62,"n_cols":35,"rows_kept":62,"cut":false,"hidden":false,"merged":[[9,29,9,31],[9,32,9,34],[61,1,61,2],[9,9,9,10],[9,11,9,12],[9,13,9,14],[9,15,9,16],[9,17,9,18],[9,19,9,20],[2,0,2,27],[7,1,10,1],[7,2,10,2],[7,3,7,26],[7,27,10,27],[8,3,8,14],[8,15,8,26],[9,3,9,4],[9,5,9,6],[9,7,9,8],[9,21,9,22],[9,23,9,24],[9,25,9,26]]}
[]
[]
["DAFTAR NILAI ASESMEN SUMATIF"]
[]
[null,null,"Mata Pelajaran",":",null,"Matematika"]
[]
{"$rows_left_out":57}
{"sheet":"TP IPAS","index":17,"n_rows":28,"n_cols":10,"rows_kept":28,"cut":false,"hidden":false,"merged":[[2,0,2,5],[2,6,2,9]]}
[]
[]
["ALUR TUJUAN PEMBELAJARAN ",null,null,null,null,null,"LINGKUP MATERI"]
[]
[null,"Mata Pelajaran",null,null,{"$f":"\": \"&IDENTITAS!$G$9","v":": Ilmu Pengetahuan Alam dan Sosial"},null,null,"Mata Pelajaran",null,{"$f":"\": \"&IDENTITAS!$G$9","v":": Ilmu Pengetahuan Alam dan Sosial"}]
[null,"Semester",null,null,{"$f":"\": \"&IDENTITAS!$D$21","v":": "},null,null,"Semester",null,{"$f":"\": \"&IDENTITAS!$D$21","v":": "}]
{"$rows_left_out":23}
{"sheet":"IPAS","index":18,"n_rows":62,"n_cols":31,"rows_kept":62,"cut":false,"hidden":false,"merged":[[9,25,9,27],[9,28,9,30],[61,1,61,2],[2,0,2,23],[7,1,10,1],[7,2,10,2],[7,3,7,22],[7,23,10,23],[8,3,8,22]]}
[]
[]
["DAFTAR NILAI ASESMEN FORMATIF"]
[]
[null,null,"Mata Pelajaran",":","Ilmu Pengetahuan Alam dan Sosial"]
[]
{"$rows_left_out":57}
{"sheet":"SUMIPAS","index":19,"n_rows":62,"n_cols":35,"rows_kept":62,"cut":false,"hidden":false,"merged":[[9,29,9,31],[9,32,9,34],[61,1,61,2],[9,9,9,10],[9,11,9,12],[9,13,9,14],[9,15,9,16],[9,17,9,18],[9,19,9,20],[2,0,2,27],[7,1,10,1],[7,2,10,2],[7,3,7,26],[7,27,10,27],[8,3,8,14],[8,15,8,26],[9,3,9,4],[9,5,9,6],[9,7,9,8],[9,21,9,22],[9,23,9,24],[9,25,9,26]]}
[]
[]
["DAFTAR NILAI ASESMEN SUMATIF"]
[]
[null,null,"Mata Pelajaran",":",null,"Ilmu Pengetahuan Alam dan Sosial"]
[]
{"$rows_left_out":57}
{"sheet":"TP MUSIK","index":20,"n_rows":28,"n_cols":10,"rows_kept":28,"cut":false,"hidden":false,"merged":[[2,0,2,5],[2,6,2,9]]}
[]
[]
["ALUR TUJUAN PEMBELAJARAN ",null,null,null,null,null,"LINGKUP MATERI"]
[]
[null,"Mata Pelajaran",null,null,{"$f":"\": \"&IDENTITAS!$G$11","v":": Seni Musik"},null,null,"Mata Pelajaran",null,{"$f":"\": \"&IDENTITAS!$G$11","v":": Seni Musik"}]
[null,"Semester",null,null,{"$f":"\": \"&IDENTITAS!$D$21","v":": "},null,null,"Semester",null,{"$f":"\": \"&IDENTITAS!$D$21","v":": "}]
{"$rows_left_out":23}
{"sheet":"MUSIK","index":21,"n_rows":62,"n_cols":31,"rows_kept":62,"cut":false,"hidden":false,"merged":[[9,25,9,27],[9,28,9,30],[61,1,61,2],[2,0,2,23],[7,1,10,1],[7,2,10,2],[7,3,7,22],[7,23,10,23],[8,3,8,22]]}
[]
[]
["DAFTAR NILAI ASESMEN FORMATIF"]
[]
[null,null,"Mata Pelajaran",":","Seni Musik"]
[]
{"$rows_left_out":57}
{"sheet":"SUMMUSIK","index":22,"n_rows":62,"n_cols":35,"rows_kept":62,"cut":false,"hidden":false,"merged":[[9,29,9,31],[9,32,9,34],[61,1,61,2],[9,9,9,10],[9,11,9,12],[9,13,9,14],[9,15,9,16],[9,17,9,18],[9,19,9,20],[2,0,2,27],[7,1,10,1],[7,2,10,2],[7,3,7,26],[7,27,10,27],[8,3,8,14],[8,15,8,26],[9,3,9,4],[9,5,9,6],[9,7,9,8],[9,21,9,22],[9,23,9,24],[9,25,9,26]]}
[]
[]
["DAFTAR NILAI ASESMEN SUMATIF"]
[]
[null,null,"Mata Pelajaran",":",null,"Seni Musik"]
[]
{"$rows_left_out":57}
{"sheet":"TP TARI","index":23,"n_rows":28,"n_cols":10,"rows_kept":28,"cut":false,"hidden":false,"merged":[[2,0,2,5],[2,6,2,9]]}
[]
[]
["ALUR TUJUAN PEMBELAJARAN ",null,null,null,null,null,"LINGKUP MATERI"]
[]
[null,"Mata Pelajaran",null,null,{"$f":"\": \"&IDENTITAS!$G$12","v":": Seni Tari"},null,null,"Mata Pelajaran",null,{"$f":"\": \"&IDENTITAS!$G$12","v":": Seni Tari"}]
[null,"Semester",null,null,{"$f":"\": \"&IDENTITAS!$D$21","v":": "},null,null,"Semester",null,{"$f":"\": \"&IDENTITAS!$D$21","v":": "}]
{"$rows_left_out":23}
{"sheet":"TARI","index":24,"n_rows":62,"n_cols":31,"rows_kept":62,"cut":false,"hidden":false,"merged":[[9,25,9,27],[9,28,9,30],[61,1,61,2],[2,0,2,23],[7,1,10,1],[7,2,10,2],[7,3,7,22],[7,23,10,23],[8,3,8,22]]}
[]
[]
["DAFTAR NILAI ASESMEN FORMATIF"]
[]
[null,null,"Mata Pelajaran",":","Seni Tari"]
[]
{"$rows_left_out":57}
{"sheet":"SUMTARI","index":25,"n_rows":62,"n_cols":35,"rows_kept":62,"cut":false,"hidden":false,"merged":[[9,29,9,31],[9,32,9,34],[61,1,61,2],[9,9,9,10],[9,11,9,12],[9,13,9,14],[9,15,9,16],[9,17,9,18],[9,19,9,20],[2,0,2,27],[7,1,10,1],[7,2,10,2],[7,3,7,26],[7,27,10,27],[8,3,8,14],[8,15,8,26],[9,3,9,4],[9,5,9,6],[9,7,9,8],[9,21,9,22],[9,23,9,24],[9,25,9,26]]}
[]
[]
["DAFTAR NILAI ASESMEN SUMATIF"]
[]
[null,null,"Mata Pelajaran",":",null,"Seni Tari"]
[]
{"$rows_left_out":57}
{"sheet":"TP KRIYA","index":26,"n_rows":28,"n_cols":10,"rows_kept":28,"cut":false,"hidden":false,"merged":[[2,0,2,5],[2,6,2,9]]}
[]
[]
["ALUR TUJUAN PEMBELAJARAN ",null,null,null,null,null,"LINGKUP MATERI"]
[]
[null,"Mata Pelajaran",null,null,{"$f":"\": \"&IDENTITAS!$G$13","v":": Seni Rupa"},null,null,"Mata Pelajaran",null,{"$f":"\": \"&IDENTITAS!$G$13","v":": Seni Rupa"}]
[null,"Semester",null,null,{"$f":"\": \"&IDENTITAS!$D$21","v":": "},null,null,"Semester",null,{"$f":"\": \"&IDENTITAS!$D$21","v":": "}]
{"$rows_left_out":23}
{"sheet":"KRIYA","index":27,"n_rows":62,"n_cols":31,"rows_kept":62,"cut":false,"hidden":false,"merged":[[9,25,9,27],[9,28,9,30],[61,1,61,2],[2,0,2,23],[7,1,10,1],[7,2,10,2],[7,3,7,22],[7,23,10,23],[8,3,8,22]]}
[]
[]
["DAFTAR NILAI ASESMEN FORMATIF"]
[]
[null,null,"Mata Pelajaran",":","Seni Rupa"]
[]
{"$rows_left_out":57}
{"sheet":"SUMKRIYA","index":28,"n_rows":62,"n_cols":35,"rows_kept":62,"cut":false,"hidden":false,"merged":[[9,29,9,31],[9,32,9,34],[61,1,61,2],[9,9,9,10],[9,11,9,12],[9,13,9,14],[9,15,9,16],[9,17,9,18],[9,19,9,20],[2,0,2,27],[7,1,10,1],[7,2,10,2],[7,3,7,26],[7,27,10,27],[8,3,8,14],[8,15,8,26],[9,3,9,4],[9,5,9,6],[9,7,9,8],[9,21,9,22],[9,23,9,24],[9,25,9,26]]}
[]
[]
["DAFTAR NILAI ASESMEN SUMATIF"]
[]
[null,null,"Mata Pelajaran",":",null,"Seni Rupa"]
[]
{"$rows_left_out":57}
{"sheet":"TP TEATER","index":29,"n_rows":28,"n_cols":10,"rows_kept":28,"cut":false,"hidden":false,"merged":[[2,0,2,5],[2,6,2,9]]}
[]
[]
["ALUR TUJUAN PEMBELAJARAN ",null,null,null,null,null,"LINGKUP MATERI"]
[]
[null,"Mata Pelajaran",null,null,{"$f":"\": \"&IDENTITAS!$G$14","v":": Seni Teater"},null,null,"Mata Pelajaran",null,{"$f":"\": \"&IDENTITAS!$G$14","v":": Seni Teater"}]
[null,"Semester",null,null,{"$f":"\": \"&IDENTITAS!$D$21","v":": "},null,null,"Semester",null,{"$f":"\": \"&IDENTITAS!$D$21","v":": "}]
{"$rows_left_out":23}
{"sheet":"TEATER","index":30,"n_rows":62,"n_cols":31,"rows_kept":62,"cut":false,"hidden":false,"merged":[[9,25,9,27],[9,28,9,30],[61,1,61,2],[2,0,2,23],[7,1,10,1],[7,2,10,2],[7,3,7,22],[7,23,10,23],[8,3,8,22]]}
[]
[]
["DAFTAR NILAI ASESMEN FORMATIF"]
[]
[null,null,"Mata Pelajaran",":","Seni Teater"]
[]
{"$rows_left_out":57}
{"sheet":"SUMTEATER","index":31,"n_rows":62,"n_cols":35,"rows_kept":62,"cut":false,"hidden":false,"merged":[[9,29,9,31],[9,32,9,34],[61,1,61,2],[9,9,9,10],[9,11,9,12],[9,13,9,14],[9,15,9,16],[9,17,9,18],[9,19,9,20],[2,0,2,27],[7,1,10,1],[7,2,10,2],[7,3,7,26],[7,27,10,27],[8,3,8,14],[8,15,8,26],[9,3,9,4],[9,5,9,6],[9,7,9,8],[9,21,9,22],[9,23,9,24],[9,25,9,26]]}
[]
[]
["DAFTAR NILAI ASESMEN SUMATIF"]
[]
[null,null,"Mata Pelajaran",":",null,"Seni Teater"]
[]
{"$rows_left_out":57}
{"sheet":"TP PJOK","index":32,"n_rows":28,"n_cols":10,"rows_kept":28,"cut":false,"hidden":false,"merged":[[2,0,2,5],[2,6,2,9]]}
[]
[]
["ALUR TUJUAN PEMBELAJARAN ",null,null,null,null,null,"LINGKUP MATERI"]
[]
[null,"Mata Pelajaran",null,null,{"$f":"\": \"&IDENTITAS!$G$15","v":": Pendidikan Jasmani dan Olahraga"},null,null,"Mata Pelajaran",null,{"$f":"\": \"&IDENTITAS!$G$15","v":": Pendidikan Jasmani dan Olahraga"}]
[null,"Semester",null,null,{"$f":"\": \"&IDENTITAS!$D$21","v":": "},null,null,"Semester",null,{"$f":"\": \"&IDENTITAS!$D$21","v":": "}]
{"$rows_left_out":23}
{"sheet":"PJOK","index":33,"n_rows":62,"n_cols":31,"rows_kept":62,"cut":false,"hidden":false,"merged":[[9,25,9,27],[9,28,9,30],[61,1,61,2],[2,0,2,23],[7,1,10,1],[7,2,10,2],[7,3,7,22],[7,23,10,23],[8,3,8,22]]}
[]
[]
["DAFTAR NILAI ASESMEN FORMATIF"]
[]
[null,null,"Mata Pelajaran",":","Pendidikan Jasmani dan Olahraga"]
[]
{"$rows_left_out":57}
{"sheet":"SUMPJOK","index":34,"n_rows":62,"n_cols":35,"rows_kept":62,"cut":false,"hidden":false,"merged":[[9,29,9,31],[9,32,9,34],[61,1,61,2],[9,9,9,10],[9,11,9,12],[9,13,9,14],[9,15,9,16],[9,17,9,18],[9,19,9,20],[2,0,2,27],[7,1,10,1],[7,2,10,2],[7,3,7,26],[7,27,10,27],[8,3,8,14],[8,15,8,26],[9,3,9,4],[9,5,9,6],[9,7,9,8],[9,21,9,22],[9,23,9,24],[9,25,9,26]]}
[]
[]
["DAFTAR NILAI ASESMEN SUMATIF"]
[]
[null,null,"Mata Pelajaran",":",null,"Pendidikan Jasmani dan Olahraga"]
[]
{"$rows_left_out":57}
{"sheet":"REKAPNA","index":35,"n_rows":62,"n_cols":23,"rows_kept":62,"cut":false,"hidden":false,"merged":[[59,1,59,2],[0,1,0,18],[1,1,1,18],[2,1,2,18],[4,1,8,1],[4,2,8,2],[4,3,5,17],[4,18,8,18]]}
[null,"REKAP NILAI AKHIR SISWA"]
[null,{"$f":"\"SEMESTER\"&\" \"&UPPER(IDENTITAS!D21)","v":"SEMESTER "}]
[null,{"$f":"\"TAHUN PELAJARAN\"&\" : \"&IDENTITAS!D22","v":"TAHUN PELAJARAN : "}]
[]
[null,"NO","Nama Siswa","REKAP MAPEL",null,null,null,null,null,null,null,null,null,null,null,null,null,null,"Keputusan"]
[]
{"$rows_left_out":57}
{"sheet":"TP BING","index":36,"n_rows":28,"n_cols":10,"rows_kept":28,"cut":false,"hidden":false,"merged":[[2,0,2,5],[2,6,2,9]]}
[]
[]
["ALUR TUJUAN PEMBELAJARAN ",null,null,null,null,null,"LINGKUP MATERI"]
[]
[null,"Mata Pelajaran",null,null,{"$f":"\": \"&IDENTITAS!$G$16","v":": Bahasa Inggris *"},null,null,"Mata Pelajaran",null,{"$f":"\": \"&IDENTITAS!$G$16","v":": Bahasa Inggris *"}]
[null,"Semester",null,null,{"$f":"\": \"&IDENTITAS!$D$21","v":": "},null,null,"Semester",null,{"$f":"\": \"&IDENTITAS!$D$21","v":": "}]
{"$rows_left_out":23}
{"sheet":"BING","index":37,"n_rows":62,"n_cols":31,"rows_kept":62,"cut":false,"hidden":false,"merged":[[9,25,9,27],[9,28,9,30],[61,1,61,2],[2,0,2,23],[7,1,10,1],[7,2,10,2],[7,3,7,22],[7,23,10,23],[8,3,8,22]]}
[]
[]
["DAFTAR NILAI ASESMEN FORMATIF"]
[]
[null,null,"Mata Pelajaran",":","Bahasa Inggris *"]
[]
{"$rows_left_out":57}
{"sheet":"SUMBING","index":38,"n_rows":62,"n_cols":35,"rows_kept":62,"cut":false,"hidden":false,"merged":[[9,29,9,31],[9,32,9,34],[61,1,61,2],[9,9,9,10],[9,11,9,12],[9,13,9,14],[9,15,9,16],[9,17,9,18],[9,19,9,20],[2,0,2,27],[7,1,10,1],[7,2,10,2],[7,3,7,26],[7,27,10,27],[8,3,8,14],[8,15,8,26],[9,3,9,4],[9,5,9,6],[9,7,9,8],[9,21,9,22],[9,23,9,24],[9,25,9,26]]}
[]
[]
["DAFTAR NILAI ASESMEN SUMATIF"]
[]
[null,null,"Mata Pelajaran",":",null,"Bahasa Inggris *"]
[]
{"$rows_left_out":57}
{"sheet":"TP MULOK1","index":39,"n_rows":28,"n_cols":10,"rows_kept":28,"cut":false,"hidden":false,"merged":[[2,0,2,5],[2,6,2,9]]}
[]
[]
["ALUR TUJUAN PEMBELAJARAN ",null,null,null,null,null,"LINGKUP MATERI"]
[]
[null,"Mata Pelajaran",null,null,{"$f":"\": \"&IDENTITAS!$G$21","v":": "},null,null,"Mata Pelajaran",null,{"$f":"\": \"&IDENTITAS!$G$21","v":": "}]
[null,"Semester",null,null,{"$f":"\": \"&IDENTITAS!$D$21","v":": "},null,null,"Semester",null,{"$f":"\": \"&IDENTITAS!$D$21","v":": "}]
{"$rows_left_out":23}
{"sheet":"MULOK1","index":40,"n_rows":62,"n_cols":31,"rows_kept":62,"cut":false,"hidden":false,"merged":[[9,25,9,27],[9,28,9,30],[61,1,61,2],[2,0,2,23],[7,1,10,1],[7,2,10,2],[7,3,7,22],[7,23,10,23],[8,3,8,22]]}
[]
[]
["DAFTAR NILAI ASESMEN FORMATIF"]
[]
[null,null,"Mata Pelajaran",":",{"$f":"IDENTITAS!G21","v":0}]
[]
{"$rows_left_out":57}
{"sheet":"SUMM1","index":41,"n_rows":62,"n_cols":35,"rows_kept":62,"cut":false,"hidden":false,"merged":[[9,29,9,31],[9,32,9,34],[61,1,61,2],[9,9,9,10],[9,11,9,12],[9,13,9,14],[9,15,9,16],[9,17,9,18],[9,19,9,20],[2,0,2,27],[7,1,10,1],[7,2,10,2],[7,3,7,26],[7,27,10,27],[8,3,8,14],[8,15,8,26],[9,3,9,4],[9,5,9,6],[9,7,9,8],[9,21,9,22],[9,23,9,24],[9,25,9,26]]}
[]
[]
["DAFTAR NILAI ASESMEN SUMATIF"]
[]
[null,null,"Mata Pelajaran",":",null,{"$f":"IDENTITAS!G21","v":0}]
[]
{"$rows_left_out":57}
{"sheet":"TP MULOK2","index":42,"n_rows":28,"n_cols":10,"rows_kept":28,"cut":false,"hidden":false,"merged":[[2,0,2,5],[2,6,2,9]]}
[]
[]
["ALUR TUJUAN PEMBELAJARAN ",null,null,null,null,null,"LINGKUP MATERI"]
[]
[null,"Mata Pelajaran",null,null,{"$f":"\": \"&IDENTITAS!$G$22","v":": "},null,null,"Mata Pelajaran",null,{"$f":"\": \"&IDENTITAS!$G$22","v":": "}]
[null,"Semester",null,null,{"$f":"\": \"&IDENTITAS!$D$21","v":": "},null,null,"Semester",null,{"$f":"\": \"&IDENTITAS!$D$21","v":": "}]
{"$rows_left_out":23}
{"sheet":"MULOK2","index":43,"n_rows":62,"n_cols":31,"rows_kept":62,"cut":false,"hidden":false,"merged":[[9,25,9,27],[9,28,9,30],[61,1,61,2],[2,0,2,23],[7,1,10,1],[7,2,10,2],[7,3,7,22],[7,23,10,23],[8,3,8,22]]}
[]
[]
["DAFTAR NILAI ASESMEN FORMATIF"]
[]
[null,null,"Mata Pelajaran",":",{"$f":"IDENTITAS!G22","v":0}]
[]
{"$rows_left_out":57}
{"sheet":"SUMM2","index":44,"n_rows":62,"n_cols":35,"rows_kept":62,"cut":false,"hidden":false,"merged":[[9,29,9,31],[9,32,9,34],[61,1,61,2],[9,9,9,10],[9,11,9,12],[9,13,9,14],[9,15,9,16],[9,17,9,18],[9,19,9,20],[2,0,2,27],[7,1,10,1],[7,2,10,2],[7,3,7,26],[7,27,10,27],[8,3,8,14],[8,15,8,26],[9,3,9,4],[9,5,9,6],[9,7,9,8],[9,21,9,22],[9,23,9,24],[9,25,9,26]]}
[]
[]
["DAFTAR NILAI ASESMEN SUMATIF"]
[]
[null,null,"Mata Pelajaran",":",null,{"$f":"IDENTITAS!G22","v":0}]
[]
{"$rows_left_out":57}
{"sheet":"IDENTITAS","index":45,"n_rows":23,"n_cols":10,"rows_kept":23,"cut":false,"hidden":false,"merged":[[1,0,1,10],[18,8,18,10]]}
[]
["IDENTITAS SEKOLAH"]
[]
[null,"Nama Sekolah",":",null,null,"No","Mata Pelajaran",null,"No.","Ekstrakurikuler"]
[null,"NPSN",":",null,null,1,"Pendidikan Agama",null,1]
[null,"NSS",":",null,null,2,"Pendidikan Pancasila dan Kewarganegaraan",null,2]
{"$rows_left_out":18}
{"sheet":"EKSTRA","index":46,"n_rows":55,"n_cols":14,"rows_kept":55,"cut":false,"hidden":false,"merged":[[1,5,3,5],[1,10,3,10],[1,6,3,6],[1,7,3,7],[1,8,3,8],[1,9,3,9],[1,0,3,0],[1,1,3,1],[1,2,3,2],[1,3,3,3],[1,4,3,4]]}
[]
["NO","NIS","NISN","NAMA PESERTA DIDIK","L/P",{"$f":"IDENTITAS!J5","v":0},{"$f":"\"Deskripsi \"&F2","v":"Deskripsi 0"},{"$f":"IDENTITAS!J6","v":0},{"$f":"\"Deskripsi \"&H2","v":"Deskripsi 0"},{"$f":"IDENTITAS!J7","v":0},{"$f":"\"Deskripsi \"&J2","v":"Deskripsi 0"}]
[]
[]
[1,2,3,4,5,6,7,8,9,10,11]
[1,{"$f":"'Data Siswa'!B6","v":0},{"$f":"'Data Siswa'!C6","v":0},{"$f":"'Data Siswa'!D6","v":0},{"$f":"'Data Siswa'!E6","v":0},null,null,null,null,null,null,null,null,"Keterangan"]
{"$rows_left_out":50}
{"sheet":"SAMPUL","index":47,"n_rows":104,"n_cols":11,"rows_kept":104,"cut":false,"hidden":false,"merged":[[42,2,42,8],[43,2,43,8],[64,2,64,8],[41,2,41,8],[69,6,69,8],[26,2,26,8],[28,2,28,8],[37,2,37,8],[38,2,38,8],[12,2,12,8],[13,2,13,8],[14,2,14,8],[15,2,15,8],[22,2,22,8],[24,2,24,8]]}
[]
[null,null,null,null,null,null,null,null,null,null,1]
[]
[]
[]
[]
{"$rows_left_out":99}
{"sheet":"Data Siswa","index":48,"n_rows":55,"n_cols":42,"rows_kept":55,"cut":false,"hidden":false,"merged":[[1,31,2,34],[1,35,2,37],[1,38,2,40],[1,41,2,41],[1,23,2,26],[1,27,2,28],[1,29,2,30],[1,0,3,0],[1,1,3,1],[1,2,3,2],[1,3,3,3],[1,4,3,4],[1,5,3,5],[1,19,2,22],[2,10,3,10],[2,11,3,11],[2,12,3,12],[2,13,3,13],[1,10,1,18],[2,14,2,18],[1,6,3,6],[1,7,3,7],[1,8,3,8],[1,9,3,9]]}
[]
["NO","NIS","NISN","NAMA PESERTA DIDIK","L/P","TEMPAT LAHIR","TANGGAL LAHIR","AGAMA","PENDIDIKAN SEBELUMNYA","ALAMAT PESERTA DIDIK","ORANG TUA",null,null,null,null,null,null,null,null,"WALI PESERTA DIDIK",null,null,null,"KEGIATAN EKTRAKURIKULER",null,null,null,"Tinggi Badan",null,"Berat Badan",null,"Kondisi Kesehatan",null,null,null,"Prestasi",null,null,"KEHADIRAN",null,null,"SARAN - SARAN"]
[null,null,null,null,null,null,null,null,null,null,"NAMA AYAH","NAMA IBU","PEKERJAAN AYAH","PEKERJAAN IBU","ALAMAT ORANG TUA"]
[null,null,null,null,null,null,null,null,null,null,null,null,null,null,"JALAN","KELURAHAN/  DESA","KECAMATAN","KAB./KOTA","PROPINSI","NAMA WALI","PEKERJAAN","ALAMAT WALI","NOMOR TELEPHON",{"$f":"IDENTITAS!J5","v":0},{"$f":"IDENTITAS!J6","v":0},{"$f":"IDENTITAS!J7","v":0},null,"Semester 1","Semester 2","Semester 1","Semester 2","Pendengaran","Penglihatan","Gigi","…","Kesenian","Olahraga","Sains","S","I","A","SARAN 1"]
[1,2,3,4,5,6,7,8,9,10,11,12,13,14,15,16,17,18,19,20,21,22,23,24,25,26,27,28,29,30,31,32,33,34,35,36,37,38,39,40,41,42]
[1]
{"$rows_left_out":50}
{"sheet":"MUTASI","index":49,"n_rows":90,"n_cols":5,"rows_kept":90,"cut":false,"hidden":false,"merged":[[74,1,74,2],[77,0,77,2],[78,0,78,2],[81,0,81,2],[68,1,68,2],[69,1,69,2],[70,1,70,2],[71,1,71,2],[72,1,72,2],[73,1,73,2],[67,1,67,2],[52,1,52,2],[53,1,53,2],[54,1,54,2],[57,1,57,2],[58,1,58,2],[59,1,59,2],[60,1,60,2],[61,1,61,2],[62,1,62,2],[63,1,63,2],[64,1,64,2],[51,1,51,2],[35,0,35,1],[36,0,36,1],[37,0,37,1],[38,0,38,1],[39,0,39,1],[41,0,41,4],[45,1,45,4],[47,1,47,2],[48,1,48,2],[49,1,49,2],[50,1,50,2],[34,0,34,1],[23,0,23,1],[24,0,24,1],[25,0,25,1],[26,0,26,1],[27,0,27,1],[28,0,28,1],[29,0,29,1],[30,0,30,1],[31,0,31,1],[32,0,32,1],[33,0,33,1],[22,0,22,1],[11,0,11,1],[12,0,12,1],[13,0,13,1],[14,0,14,1],[15,0,15,1],[16,0,16,1],[17,0,17,1],[18,0,18,1],[19,0,19,1],[20,0,20,1],[21,0,21,1],[10,0,10,1],[1,0,1,4],[6,0,6,1],[7,0,7,1],[8,0,8,1],[9,0,9,1]]}
[]
["KETERANGAN PINDAH SEKOLAH"]
[]
[]
["Nama Peserta Didik : ………………………………………………………"]
[]
{"$rows_left_out":85}
{"sheet":"INDUK","index":50,"n_rows":35,"n_cols":10,"rows_kept":35,"cut":false,"hidden":false,"merged":[[31,2,31,5],[26,3,26,5],[26,6,26,7],[27,3,27,5],[28,3,28,5],[29,3,29,5],[27,6,27,7],[28,6,28,7],[29,6,29,7],[24,3,24,6],[13,3,13,6],[14,3,14,6],[15,3,15,6],[16,3,16,6],[17,3,17,6],[18,3,18,6],[19,3,19,6],[20,3,20,6],[21,3,21,6],[22,2,22,7],[23,3,23,6],[1,0,1,8],[9,3,9,6],[10,3,10,6],[11,3,11,6],[12,3,12,6]]}
[]
["BUKU INDUK",null,null,null,null,null,null,null,null,1]
[]
[null,"Nama Peserta Didik",null,{"$f":"\": \"&VLOOKUP($J$2,'Data Siswa'!$A$6:$D$55,4,FALSE)","v":": "},null,null,"Kelas",null,{"$f":"\": \"&IDENTITAS!D19","v":": "}]
[null,"NISN",null,{"$f":"\": \"&VLOOKUP($J$2,'Data Siswa'!$A$6:$D$55,3,FALSE)","v":": "},null,null,"Fase",null,{"$f":"\": \"&IDENTITAS!D20","v":": "}]
[null,"Sekolah",null,{"$f":"\": \"&IDENTITAS!D4","v":": "},null,null,"Semester",null,{"$f":"\": \"&IDENTITAS!D21","v":": "}]
{"$rows_left_out":29}